Reaction Details
TargetNitric oxide synthase, brain
LigandBDBM50058439
Substrate/Competitorn/a
Meas. Tech.ChEMBL_143376 (CHEMBL880847)
Ki 1100±n/a nM
Citation Shearer, BGLee, SOplinger, JAFrick, LWGarvey, EPFurfine, ES Substituted N-phenylisothioureas: potent inhibitors of human nitric oxide synthase with neuronal isoform selectivity. J Med Chem40:1901-5 (1997) 
 
Nitric oxide synthase, brain
Name:Nitric oxide synthase, brain
Type:Homodimer
Mol. Mass.:160985.98
Organism:Homo sapiens (Human)
Description:P29475
Residue:1434
BDBM50058439
NameBDBM50058439
Synonyms:2-Ethyl-1-(2-isopropyl-phenyl)-isothiourea; hydrochloride CHEMBL543566
TypeSmall organic molecule
Emp. Form.C12H18N2S
Mol. Mass.222.35
SMILESCCSC(N)=Nc1ccccc1C(C)C