Reaction Details
TargetAdenosine receptor A2a
LigandBDBM50049391
Substrate/Competitorn/a
Meas. Tech.ChEMBL_31367 (CHEMBL644659)
Ki 18100±n/a nM
Citation Jiang, QLee, BXGlashofer, Mvan Rhee, AMJacobson, KA Mutagenesis reveals structure-activity parallels between human A2A adenosine receptors and biogenic amine G protein-coupled receptors. J Med Chem40:2588-95 (1997) 
 
Adenosine receptor A2a
Name:Adenosine receptor A2a
Type:G Protein-Coupled Receptor (GPCR)
Mol. Mass.:44716.46
Organism:Homo sapiens (Human)
Description:P29274
Residue:412
BDBM50049391
NameBDBM50049391
Synonyms:3,5,7-Trihydroxyflavone 3,5,7-trihydroxy-2-phenyl-4H-benzopyran-4-one CHEMBL309490 Galangin (15) cid_5281616 | norizalpinin
TypeSmall organic molecule
Emp. Form.C15H10O5
Mol. Mass.270.2369
SMILESOc1cc(O)c2c(c1)oc(-c1ccccc1)c(O)c2=O