Reaction Details
TargetAdenosine receptor A2a
LigandBDBM50004566
Substrate/Competitorn/a
Meas. Tech.ChEMBL_31366 (CHEMBL644658)
Ki 0.46±n/a nM
Citation Jiang, QLee, BXGlashofer, Mvan Rhee, AMJacobson, KA Mutagenesis reveals structure-activity parallels between human A2A adenosine receptors and biogenic amine G protein-coupled receptors. J Med Chem40:2588-95 (1997) 
 
Adenosine receptor A2a
Name:Adenosine receptor A2a
Type:G Protein-Coupled Receptor (GPCR)
Mol. Mass.:44716.46
Organism:Homo sapiens (Human)
Description:P29274
Residue:412
BDBM50004566
NameBDBM50004566
Synonyms:9-Chloro-2-furan-2-yl-[1,2,4]triazolo[1,5-c]quinazolin-5-ylamine 9-Chloro-[1,2,4]triazolo[1,5-c]quinazolin-5-ylamine(CGS 15943) 9-chloro-2-(furan-2-yl)-[1,2,4]triazolo[1,5-c]quinazolin-5-amine CHEMBL16687 Nonnucleoside analog, 4
TypeSmall organic molecule
Emp. Form.C13H8ClN5O
Mol. Mass.285.689
SMILESNc1nc2ccc(Cl)cc2c2nc(nn12)-c1ccco1