Reaction Details
TargetD(2) dopamine receptor
LigandBDBM50060603
Substrate/Competitorn/a
Meas. Tech.ChEMBL_59619 (CHEMBL670955)
Ki 0.067000±n/a nM
Citation Baures, PWOjala, WHCostain, WJOtt, MCPradhan, AGleason, WBMishra, RKJohnson, RL Design, synthesis, and dopamine receptor modulating activity of diketopiperazine peptidomimetics of L-prolyl-L-leucylglycinamide. J Med Chem40:3594-600 (1997) 
 
D(2) dopamine receptor
Name:D(2) dopamine receptor
Type:Enzyme Catalytic Domain
Mol. Mass.:50698.79
Organism:BOVINE
Description:P20288
Residue:444
BDBM50060603
NameBDBM50060603
Synonyms:(3S,7aR)-6-((2R,8aS)-1,4-Dioxo-hexahydro-pyrrolo[1,2-a]pyrazin-2-yl)-5-oxo-hexahydro-pyrrolo[2,1-b]thiazole-3-carboxylic acid amide
TypeSmall organic molecule
Emp. Form.C14H18N4O4S
Mol. Mass.338.382
SMILESNC(=O)[C@H]1CS[C@@H]2CC(N3CC(=O)N4CCC[C@H]4C3=O)C(=O)N12