Reaction Details
TargetGlutamate receptor ionotropic, kainate 5
LigandBDBM50060628
Substrate/Competitorn/a
Meas. Tech.ChEMBL_90444 (CHEMBL698076)
Ki 31±n/a nM
Citation Jane, DEHoo, KKamboj, RDeverill, MBleakman, DMandelzys, A Synthesis of willardiine and 6-azawillardiine analogs: pharmacological characterization on cloned homomeric human AMPA and kainate receptor subtypes. J Med Chem40:3645-50 (1997) 
 
Glutamate receptor ionotropic, kainate 5
Name:Glutamate receptor ionotropic, kainate 5
Type:Enzyme Catalytic Domain
Mol. Mass.:109280.81
Organism:Homo sapiens (Human)
Description:Glutamate-Kainate 5 Grik5 HUMAN::Q16478
Residue:980
BDBM50060628
NameBDBM50060628
Synonyms:(S)-2-Amino-3-(6-chloro-3,5-dioxo-4,5-dihydro-3H-[1,2,4]triazin-2-yl)-propionic acid | CHEMBL331696
TypeSmall organic molecule
Emp. Form.C6H7ClN4O4
Mol. Mass.234.597
SMILESN[C@@H](Cn1nc(Cl)c(=O)[nH]c1=O)C(O)=O