Reaction Details
TargetGlutamate receptor ionotropic, kainate 5
LigandBDBM50002369
Substrate/Competitorn/a
Meas. Tech.ChEMBL_90444 (CHEMBL698076)
Ki 177±n/a nM
Citation Jane, DEHoo, KKamboj, RDeverill, MBleakman, DMandelzys, A Synthesis of willardiine and 6-azawillardiine analogs: pharmacological characterization on cloned homomeric human AMPA and kainate receptor subtypes. J Med Chem40:3645-50 (1997) 
 
Glutamate receptor ionotropic, kainate 5
Name:Glutamate receptor ionotropic, kainate 5
Type:Enzyme Catalytic Domain
Mol. Mass.:109280.81
Organism:Homo sapiens (Human)
Description:Glutamate-Kainate 5 Grik5 HUMAN::Q16478
Residue:980
BDBM50002369
NameBDBM50002369
Synonyms:(2S-(2alpha,3beta,4beta))-2-carboxy-4-(1-methylethenyl)-3-pyrrolidineacetic acid CHEMBL275040 Digensaeure Kainate L-alpha-kainic acid digenic acid | kainic acid
TypeSmall organic molecule
Emp. Form.C10H15NO4
Mol. Mass.213.2304
SMILESCC(=C)[C@H]1CN[C@@H]([C@H]1CC(O)=O)C(O)=O