Reaction Details
Target5-hydroxytryptamine receptor 1B
LigandBDBM10755
Substrate/Competitorn/a
Meas. Tech.ChEMBL_1780 (CHEMBL616754)
IC50 4.6±n/a nM
Citation Campiani, GCappelli, ANacci, VAnzini, MVomero, SHamon, MCagnotto, AFracasso, CUboldi, CCaccia, SConsolo, SMennini, T Novel and highly potent 5-HT3 receptor agonists based on a pyrroloquinoxaline structure. J Med Chem40:3670-8 (1997) 
 
5-hydroxytryptamine receptor 1B
Name:5-hydroxytryptamine receptor 1B
Type:Protein
Mol. Mass.:43173.33
Organism:Rattus norvegicus (Rat)
Description:P28564
Residue:386
BDBM10755
NameBDBM10755
Synonyms:14C-5-hydroxy tryptamine creatinine disulfate 5-HT 5-hydroxy tryptamine creatinine disulfate Serotonin | [3H]-5-HT
TypeSmall organic molecule
Emp. Form.C10H12N2O
Mol. Mass.176.2151
SMILESNCCc1c[nH]c2ccc(O)cc12