Reaction Details
Target5-hydroxytryptamine receptor 2C
LigandBDBM50060684
Substrate/Competitorn/a
Meas. Tech.ChEMBL_2808 (CHEMBL617838)
IC50 784±n/a nM
Citation Campiani, GCappelli, ANacci, VAnzini, MVomero, SHamon, MCagnotto, AFracasso, CUboldi, CCaccia, SConsolo, SMennini, T Novel and highly potent 5-HT3 receptor agonists based on a pyrroloquinoxaline structure. J Med Chem40:3670-8 (1997) 
 
5-hydroxytryptamine receptor 2C
Name:5-hydroxytryptamine receptor 2C
Type:Enzyme
Mol. Mass.:51935.10
Organism:Rattus norvegicus (Rat)
Description:P08909
Residue:460
BDBM50060684
NameBDBM50060684
Synonyms:9-Fluoro-4-piperazin-1-yl-pyrrolo[1,2-a]quinoxaline | CHEMBL331304
TypeSmall organic molecule
Emp. Form.C15H15FN4
Mol. Mass.270.3048
SMILESFc1cccc2nc(N3CCNCC3)c3cccn3c12