Reaction Details
TargetGastrin/cholecystokinin type B receptor
LigandBDBM50061267
Substrate/Competitorn/a
Meas. Tech.ChEMBL_48606 (CHEMBL659587)
Ki 19±n/a nM
Citation Bellier, BMcCort-Tranchepain, IDucos, BDanascimento, SMeudal, HNoble, FGarbay, CRoques, BP Synthesis and biological properties of new constrained CCK-B antagonists: discrimination of two affinity states of the CCK-B receptor on transfected CHO cells. J Med Chem40:3947-56 (1998) 
 
Gastrin/cholecystokinin type B receptor
Name:Gastrin/cholecystokinin type B receptor
Type:Enzyme Catalytic Domain
Mol. Mass.:48980.43
Organism:RAT
Description:Cholecystokinin A CCKBR RAT::P30553
Residue:452
BDBM50061267
NameBDBM50061267
Synonyms:(2R,4R)-1-[(R)-2-(2-Aza-tricyclo[3.3.1.1*3,7*]dec-2-yloxycarbonylamino)-3-(1H-indol-3-yl)-2-methyl-propionyl]-4-(2,4-difluoro-phenoxy)-pyrrolidine-2-carboxylic acid | CHEMBL338300
TypeSmall organic molecule
Emp. Form.C33H36F2N4O6
Mol. Mass.622.6589
SMILESC[C@](Cc1c[nH]c2ccccc12)(NC(=O)ON1[C@H]2C[C@@H]3C[C@@H](C[C@H]1C3)C2)C(=O)N1C[C@@H](C[C@@H]1C(O)=O)Oc1ccc(F)cc1F