Reaction Details
TargetGastrin/cholecystokinin type B receptor
LigandBDBM50061282
Substrate/Competitorn/a
Meas. Tech.ChEMBL_48103 (CHEMBL663090)
Ki 56±n/a nM
Citation Bellier, BMcCort-Tranchepain, IDucos, BDanascimento, SMeudal, HNoble, FGarbay, CRoques, BP Synthesis and biological properties of new constrained CCK-B antagonists: discrimination of two affinity states of the CCK-B receptor on transfected CHO cells. J Med Chem40:3947-56 (1998) 
 
Gastrin/cholecystokinin type B receptor
Name:Gastrin/cholecystokinin type B receptor
Type:G Protein-Coupled Receptor (GPCR)
Mol. Mass.:48445.79
Organism:Homo sapiens (Human)
Description:Stable expression of human CCK-2 receptors in HEK 293 cells.
Residue:447
BDBM50061282
NameBDBM50061282
Synonyms:(2R,4R)-1-[(R)-2-(2-Aza-tricyclo[3.3.1.1*3,7*]dec-2-yloxycarbonylamino)-3-(1H-indol-3-yl)-2-methyl-propionyl]-4-(3-chloro-benzyloxy)-pyrrolidine-2-carboxylic acid | CHEMBL434631
TypeSmall organic molecule
Emp. Form.C34H39ClN4O6
Mol. Mass.635.15
SMILESC[C@](Cc1c[nH]c2ccccc12)(NC(=O)ON1[C@H]2C[C@@H]3C[C@@H](C[C@H]1C3)C2)C(=O)N1C[C@@H](C[C@@H]1C(O)=O)OCc1cccc(Cl)c1