Reaction Details
TargetGastrin/cholecystokinin type B receptor
LigandBDBM81962
Substrate/Competitorn/a
Meas. Tech.ChEMBL_48586 (CHEMBL662466)
IC50 39±n/a nM
Citation Bellier, BMcCort-Tranchepain, IDucos, BDanascimento, SMeudal, HNoble, FGarbay, CRoques, BP Synthesis and biological properties of new constrained CCK-B antagonists: discrimination of two affinity states of the CCK-B receptor on transfected CHO cells. J Med Chem40:3947-56 (1998) 
 
Gastrin/cholecystokinin type B receptor
Name:Gastrin/cholecystokinin type B receptor
Type:Enzyme Catalytic Domain
Mol. Mass.:48980.43
Organism:RAT
Description:Cholecystokinin A CCKBR RAT::P30553
Residue:452
BDBM81962
NameBDBM81962
Synonyms:S-L-365,260
Typen/a
Emp. Form.C24H22N4O2
Mol. Mass.398.4571
SMILESCN1c2ccccc2C(=N[C@@H](NC(=O)Nc2cccc(C)c2)C1=O)c1ccccc1