Reaction Details
Target5-hydroxytryptamine receptor 1B
LigandBDBM50016912
Substrate/Competitorn/a
Meas. Tech.ChEMBL_1354 (CHEMBL616539)
Ki 255±n/a nM
Citation Ismaiel, AMDukat, MLaw, HKamboj, RFan, ELee, DKMazzocco, LBuekschkens, DTeitler, MPierson, MEGlennon, RA 2-(1-Naphthyloxy)ethylamines with enhanced affinity for human 5-HT1D beta (h5-HT1B) serotonin receptors. J Med Chem40:4415-9 (1998) 
 
5-hydroxytryptamine receptor 1B
Name:5-hydroxytryptamine receptor 1B
Type:G Protein-Coupled Receptor (GPCR)
Mol. Mass.:43579.17
Organism:Homo sapiens (Human)
Description:Receptor binding assays were performed using human clone stably expressed in CHO cells
Residue:390
BDBM50016912
NameBDBM50016912
Synonyms:CHEMBL138136 | Dimethyl-[3-(naphthalen-1-yloxy)-propyl]-amine
TypeSmall organic molecule
Emp. Form.C15H19NO
Mol. Mass.229.3175
SMILESCN(C)CCCOc1cccc2ccccc12