Reaction Details
Target5-hydroxytryptamine receptor 1D
LigandBDBM50061971
Substrate/Competitorn/a
Meas. Tech.ChEMBL_2003 (CHEMBL617096)
Ki 34±n/a nM
Citation Ismaiel, AMDukat, MLaw, HKamboj, RFan, ELee, DKMazzocco, LBuekschkens, DTeitler, MPierson, MEGlennon, RA 2-(1-Naphthyloxy)ethylamines with enhanced affinity for human 5-HT1D beta (h5-HT1B) serotonin receptors. J Med Chem40:4415-9 (1998) 
 
5-hydroxytryptamine receptor 1D
Name:5-hydroxytryptamine receptor 1D
Type:G Protein-Coupled Receptor (GPCR)
Mol. Mass.:41920.63
Organism:Homo sapiens (Human)
Description:Receptor binding assays were performed using human clone stably expressed in CHO cells.
Residue:377
BDBM50061971
NameBDBM50061971
Synonyms:CHEMBL138958 | Methyl-[2-(naphthalen-1-yloxy)-ethyl]-amine
TypeSmall organic molecule
Emp. Form.C13H15NO
Mol. Mass.201.2643
SMILESCNCCOc1cccc2ccccc12