Reaction Details
TargetHistamine H1 receptor
LigandBDBM50056947
Substrate/Competitorn/a
Meas. Tech.ChEMBL_84717 (CHEMBL695165)
Ki 70±n/a nM
Citation el Ahmad, YLaurent, EMaillet, PTalab, ATeste, JFDokhan, RTran, GOllivier, R New benzocycloalkylpiperazines, potent and selective 5-HT1A receptor ligands. J Med Chem40:952-60 (1997) 
 
Histamine H1 receptor
Name:Histamine H1 receptor
Type:Enzyme Catalytic Domain
Mol. Mass.:55716.35
Organism:RAT
Description:HISTAMINE H1 HRH1 RAT::P31390
Residue:486
BDBM50056947
NameBDBM50056947
Synonyms:CHEMBL354210 | N-{2-[4-(1,2,3,4-Tetrahydro-naphthalen-1-yl)-piperazin-1-yl]-ethyl}-benzamide
TypeSmall organic molecule
Emp. Form.C23H29N3O
Mol. Mass.363.4959
SMILESO=C(NCCN1CCN(CC1)C1CCCc2ccccc12)c1ccccc1