Reaction Details
TargetD(1A) dopamine receptor
LigandBDBM50056944
Substrate/Competitorn/a
Meas. Tech.ChEMBL_60344 (CHEMBL671330)
Ki 2060±n/a nM
Citation el Ahmad, YLaurent, EMaillet, PTalab, ATeste, JFDokhan, RTran, GOllivier, R New benzocycloalkylpiperazines, potent and selective 5-HT1A receptor ligands. J Med Chem40:952-60 (1997) 
 
D(1A) dopamine receptor
Name:D(1A) dopamine receptor
Type:Enzyme Catalytic Domain
Mol. Mass.:49330.65
Organism:BOVINE
Description:DOPAMINE D1 DRD1 BOVINE::Q95136
Residue:446
BDBM50056944
NameBDBM50056944
Synonyms:4-Fluoro-N-{2-[4-(1,2,3,4-tetrahydro-naphthalen-1-yl)-piperazin-1-yl]-ethyl}-benzamide | CHEMBL368061
TypeSmall organic molecule
Emp. Form.C23H28FN3O
Mol. Mass.381.4863
SMILESFc1ccc(cc1)C(=O)NCCN1CCN(CC1)C1CCCc2ccccc12