Reaction Details
TargetMuscarinic acetylcholine receptor M1
LigandBDBM50046723
Substrate/Competitorn/a
Meas. Tech.ChEMBL_138672 (CHEMBL748051)
Ki 2.5±n/a nM
Citation Messer, WSAbuh, YFLiu, YPeriyasamy, SNgur, DOEdgar, MAEl-Assadi, AASbeih, SDunbar, PGRoknich, SRho, TFang, ZOjo, BZhang, HHuzl, JJNagy, PI Synthesis and biological characterization of 1,4,5,6-tetrahydropyrimidine and 2-amino-3,4,5,6-tetrahydropyridine derivatives as selective m1 agonists. J Med Chem40:1230-46 (1997) 
 
Muscarinic acetylcholine receptor M1
Name:Muscarinic acetylcholine receptor M1
Type:Enzyme Catalytic Domain
Mol. Mass.:51400.50
Organism:Mus musculus
Description:Cholinergic, muscarinic 0 0::Q52KQ0
Residue:460
BDBM50046723
NameBDBM50046723
Synonyms:5-(3-Methyl-[1,2,4]oxadiazol-5-yl)-1,4,5,6-tetrahydro-pyrimidine; TFA | CHEMBL277014
TypeSmall organic molecule
Emp. Form.C7H10N4O
Mol. Mass.166.1805
SMILESCc1noc(n1)C1CNC=NC1