Reaction Details
TargetD(2) dopamine receptor
LigandBDBM50057431
Substrate/Competitorn/a
Meas. Tech.ChEMBL_62897 (CHEMBL676136)
Ki 1.8±n/a nM
Citation Yasunaga, TNaito, RKontani, TTsukamoto, SNomura, TYamaguchi, TMase, T N-[2-[(substituted chroman-8-yl)oxy]ethyl]-4-(4-methoxyphenyl)butylamines: synthesis and wide range of antagonism at the human 5-HT1A receptor. J Med Chem40:1252-7 (1997) 
 
D(2) dopamine receptor
Name:D(2) dopamine receptor
Type:G Protein-Coupled Receptor (GPCR)
Mol. Mass.:50931.60
Organism:Rattus norvegicus (rat)
Description:P61169
Residue:444
BDBM50057431
NameBDBM50057431
Synonyms:CHEMBL21475 | [4-(4-Methoxy-phenyl)-butyl]-[2-(6-methyl-chroman-8-yloxy)-ethyl]-amine
TypeSmall organic molecule
Emp. Form.C23H31NO3
Mol. Mass.369.4971
SMILESCOc1ccc(CCCCNCCOc2cc(C)cc3CCCOc23)cc1