Reaction Details
Target5-hydroxytryptamine receptor 1A
LigandBDBM50057434
Substrate/Competitorn/a
Meas. Tech.ChEMBL_1425 (CHEMBL616505)
Ki 0.27±n/a nM
Citation Yasunaga, TNaito, RKontani, TTsukamoto, SNomura, TYamaguchi, TMase, T N-[2-[(substituted chroman-8-yl)oxy]ethyl]-4-(4-methoxyphenyl)butylamines: synthesis and wide range of antagonism at the human 5-HT1A receptor. J Med Chem40:1252-7 (1997) 
 
5-hydroxytryptamine receptor 1A
Name:5-hydroxytryptamine receptor 1A
Type:G Protein-Coupled Receptor (GPCR)
Mol. Mass.:46445.29
Organism:Rattus norvegicus (rat)
Description:Binding assays were performed using rat hippocampal membranes.
Residue:422
BDBM50057434
NameBDBM50057434
Synonyms:8-{2-[4-(4-Methoxy-phenyl)-butylamino]-ethoxy}-chroman-6-ol | CHEMBL22802
TypeSmall organic molecule
Emp. Form.C22H29NO4
Mol. Mass.371.47
SMILESCOc1ccc(CCCCNCCOc2cc(O)cc3CCCOc23)cc1