Reaction Details
TargetD(2) dopamine receptor
LigandBDBM50057435
Substrate/Competitorn/a
Meas. Tech.ChEMBL_62897 (CHEMBL676136)
Ki 1.8±n/a nM
Citation Yasunaga, TNaito, RKontani, TTsukamoto, SNomura, TYamaguchi, TMase, T N-[2-[(substituted chroman-8-yl)oxy]ethyl]-4-(4-methoxyphenyl)butylamines: synthesis and wide range of antagonism at the human 5-HT1A receptor. J Med Chem40:1252-7 (1997) 
 
D(2) dopamine receptor
Name:D(2) dopamine receptor
Type:G Protein-Coupled Receptor (GPCR)
Mol. Mass.:50931.60
Organism:Rattus norvegicus (rat)
Description:P61169
Residue:444
BDBM50057435
NameBDBM50057435
Synonyms:CHEMBL25663 | [2-(6-Methoxy-chroman-8-yloxy)-ethyl]-[4-(4-methoxy-phenyl)-butyl]-amine
TypeSmall organic molecule
Emp. Form.C23H31NO4
Mol. Mass.385.4965
SMILESCOc1ccc(CCCCNCCOc2cc(OC)cc3CCCOc23)cc1