Reaction Details
Target5-hydroxytryptamine receptor 1A
LigandBDBM50064561
Substrate/Competitorn/a
Meas. Tech.ChEMBL_1159 (CHEMBL616104)
Ki 1.1±n/a nM
Citation Reitz, ABBaxter, EWCodd, EEDavis, CBJordan, ADMaryanoff, BEMaryanoff, CAMcDonnell, MEPowell, ETRenzi, MJSchott, MRScott, MKShank, RPVaught, JL Orally active benzamide antipsychotic agents with affinity for dopamine D2, serotonin 5-HT1A, and adrenergic alpha1 receptors. J Med Chem41:1997-2009 (1998) 
 
5-hydroxytryptamine receptor 1A
Name:5-hydroxytryptamine receptor 1A
Type:G Protein-Coupled Receptor (GPCR)
Mol. Mass.:46445.29
Organism:Rattus norvegicus (rat)
Description:Binding assays were performed using rat hippocampal membranes.
Residue:422
BDBM50064561
NameBDBM50064561
Synonyms:CHEMBL60122 | {3-[4-(2-Isopropoxy-phenyl)-piperazin-1-ylmethyl]-phenyl}-piperidin-1-yl-methanethione
TypeSmall organic molecule
Emp. Form.C26H35N3OS
Mol. Mass.437.641
SMILESCC(C)Oc1ccccc1N1CCN(Cc2cccc(c2)C(=S)N2CCCCC2)CC1