Reaction Details
TargetD(2) dopamine receptor
LigandBDBM50064548
Substrate/Competitorn/a
Meas. Tech.ChEMBL_62547 (CHEMBL674060)
Ki 6.3±n/a nM
Citation Reitz, ABBaxter, EWCodd, EEDavis, CBJordan, ADMaryanoff, BEMaryanoff, CAMcDonnell, MEPowell, ETRenzi, MJSchott, MRScott, MKShank, RPVaught, JL Orally active benzamide antipsychotic agents with affinity for dopamine D2, serotonin 5-HT1A, and adrenergic alpha1 receptors. J Med Chem41:1997-2009 (1998) 
 
D(2) dopamine receptor
Name:D(2) dopamine receptor
Type:G Protein-Coupled Receptor (GPCR)
Mol. Mass.:50931.60
Organism:Rattus norvegicus (rat)
Description:P61169
Residue:444
BDBM50064548
NameBDBM50064548
Synonyms:Azepan-1-yl-{3-[4-(2-isopropoxy-phenyl)-piperazin-1-ylmethyl]-phenyl}-methanone | CHEMBL64702
TypeSmall organic molecule
Emp. Form.C27H37N3O2
Mol. Mass.435.6016
SMILESCC(C)Oc1ccccc1N1CCN(Cc2cccc(c2)C(=O)N2CCCCCC2)CC1