Reaction Details
TargetSomatostatin receptor type 2
LigandBDBM50454936
Substrate/Competitorn/a
Meas. Tech.ChEMBL_200366 (CHEMBL805714)
Ki 53±n/a nM
Citation Yang, LGuo, LPasternak, AMosley, RRohrer, SBirzin, EFoor, FCheng, KSchaeffer, JPatchett, AA Spiro[1H-indene-1,4'-piperidine] derivatives as potent and selective non-peptide human somatostatin receptor subtype 2 (sst2) agonists. J Med Chem41:2175-9 (1998) 
 
Somatostatin receptor type 2
Name:Somatostatin receptor type 2
Type:Enzyme
Mol. Mass.:41344.94
Organism:Homo sapiens (Human)
Description:P30874
Residue:369
BDBM50454936
NameBDBM50454936
Synonyms:CHEMBL2112222
TypeSmall organic molecule
Emp. Form.C31H38N6O3
Mol. Mass.542.6718
SMILESNCCCCC(NC(=O)[C@@H](Cc1c[nH]c2ccccc12)NC(=O)N1CCC2(CC1)C=Cc1ccccc21)C(N)=O