Reaction Details
TargetSomatostatin receptor type 2
LigandBDBM50064773
Substrate/Competitorn/a
Meas. Tech.ChEMBL_200366 (CHEMBL805714)
Ki 1740±n/a nM
Citation Yang, LGuo, LPasternak, AMosley, RRohrer, SBirzin, EFoor, FCheng, KSchaeffer, JPatchett, AA Spiro[1H-indene-1,4'-piperidine] derivatives as potent and selective non-peptide human somatostatin receptor subtype 2 (sst2) agonists. J Med Chem41:2175-9 (1998) 
 
Somatostatin receptor type 2
Name:Somatostatin receptor type 2
Type:Enzyme
Mol. Mass.:41344.94
Organism:Homo sapiens (Human)
Description:P30874
Residue:369
BDBM50064773
NameBDBM50064773
Synonyms:1'N-[1-[3-aminomethyl-(1S,3R)-cyclohexylmethylcarbamoyl]-2-(1H-3-indolyl)-(1S)-ethyl]spiro[1H-indene-1,4'-(hexahydropyridine)]-1'-carboxamide | CHEMBL71723
TypeSmall organic molecule
Emp. Form.C33H41N5O2
Mol. Mass.539.7109
SMILESNC[C@@H]1CCC[C@H](CNC(=O)[C@H](Cc2c[nH]c3ccccc23)NC(=O)N2CCC3(CC2)C=Cc2ccccc32)C1