Reaction Details
TargetSomatostatin receptor type 2
LigandBDBM50064782
Substrate/Competitorn/a
Meas. Tech.ChEMBL_200366 (CHEMBL805714)
Ki 300±n/a nM
Citation Yang, LGuo, LPasternak, AMosley, RRohrer, SBirzin, EFoor, FCheng, KSchaeffer, JPatchett, AA Spiro[1H-indene-1,4'-piperidine] derivatives as potent and selective non-peptide human somatostatin receptor subtype 2 (sst2) agonists. J Med Chem41:2175-9 (1998) 
 
Somatostatin receptor type 2
Name:Somatostatin receptor type 2
Type:Enzyme
Mol. Mass.:41344.94
Organism:Homo sapiens (Human)
Description:P30874
Residue:369
BDBM50064782
NameBDBM50064782
Synonyms:1'N-[1-(4-aminobutylcarbamoyl)-2-(1H-3-indolyl)-(1S)-ethyl]spiro[1H-indene-1,4'-(hexahydropyridine)]-1'-carboxamide | CHEMBL69575
TypeSmall organic molecule
Emp. Form.C29H35N5O2
Mol. Mass.485.6205
SMILESNCCCCNC(=O)[C@H](Cc1c[nH]c2ccccc12)NC(=O)N1CCC2(CC1)C=Cc1ccccc21