Reaction Details
TargetCalpain-1 catalytic subunit
LigandBDBM50065405
Substrate/Competitorn/a
Meas. Tech.ChEMBL_43870 (CHEMBL658530)
Ki 10±n/a nM
Citation Chatterjee, SGu, ZQDunn, DTao, MJosef, KTripathy, RBihovsky, RSenadhi, SEO'Kane, TMMcKenna, BAMallya, SAtor, MABozyczko-Coyne, DSiman, RMallamo, JP D-amino acid containing, high-affinity inhibitors of recombinant human calpain I. J Med Chem41:2663-6 (1998) 
 
Calpain-1 catalytic subunit
Name:Calpain-1 catalytic subunit
Type:Protein
Mol. Mass.:81880.51
Organism:Homo sapiens (Human)
Description:n/a
Residue:714
BDBM50065405
NameBDBM50065405
Synonyms:(R)-N-((S)-1-Benzyl-2-oxo-ethyl)-3-(1H-indol-3-yl)-2-methanesulfonylamino-propionamide | CHEMBL420423
TypeSmall organic molecule
Emp. Form.C21H23N3O4S
Mol. Mass.413.49
SMILESCS(=O)(=O)N[C@H](Cc1c[nH]c2ccccc12)C(=O)N[C@@H](Cc1ccccc1)C=O