Reaction Details
TargetNitric oxide synthase, brain
LigandBDBM50065807
Substrate/Competitorn/a
Meas. Tech.ChEMBL_143377 (CHEMBL752276)
Ki 6.3±n/a nM
Citation Collins, JLShearer, BGOplinger, JALee, SGarvey, EPSalter, MDuffy, CBurnette, TCFurfine, ES N-Phenylamidines as selective inhibitors of human neuronal nitric oxide synthase: structure-activity studies and demonstration of in vivo activity. J Med Chem41:2858-71 (1998) 
 
Nitric oxide synthase, brain
Name:Nitric oxide synthase, brain
Type:Homodimer
Mol. Mass.:160985.98
Organism:Homo sapiens (Human)
Description:P29475
Residue:1434
BDBM50065807
NameBDBM50065807
Synonyms:CHEMBL552825 | N-(3-Aminomethyl-phenyl)-furan-2-carboxamidine
TypeSmall organic molecule
Emp. Form.C12H13N3O
Mol. Mass.215.2511
SMILESNCc1cccc(c1)N=C(N)c1ccco1