Reaction Details
TargetNitric oxide synthase, brain
LigandBDBM50065815
Substrate/Competitorn/a
Meas. Tech.ChEMBL_143377 (CHEMBL752276)
Ki 570±n/a nM
Citation Collins, JLShearer, BGOplinger, JALee, SGarvey, EPSalter, MDuffy, CBurnette, TCFurfine, ES N-Phenylamidines as selective inhibitors of human neuronal nitric oxide synthase: structure-activity studies and demonstration of in vivo activity. J Med Chem41:2858-71 (1998) 
 
Nitric oxide synthase, brain
Name:Nitric oxide synthase, brain
Type:Homodimer
Mol. Mass.:160985.98
Organism:Homo sapiens (Human)
Description:P29475
Residue:1434
BDBM50065815
NameBDBM50065815
Synonyms:4-Acetimidoylamino-benzamidine | CHEMBL543380
TypeSmall organic molecule
Emp. Form.C9H12N4
Mol. Mass.176.2184
SMILESCC(N)=Nc1ccc(cc1)C(N)=N