Reaction Details
TargetNitric oxide synthase, inducible
LigandBDBM50065828
Substrate/Competitorn/a
Meas. Tech.ChEMBL_89333 (CHEMBL702708)
Ki 2500±n/a nM
Citation Collins, JLShearer, BGOplinger, JALee, SGarvey, EPSalter, MDuffy, CBurnette, TCFurfine, ES N-Phenylamidines as selective inhibitors of human neuronal nitric oxide synthase: structure-activity studies and demonstration of in vivo activity. J Med Chem41:2858-71 (1998) 
 
Nitric oxide synthase, inducible
Name:Nitric oxide synthase, inducible
Type:Homodimer
Mol. Mass.:131141.95
Organism:Homo sapiens (Human)
Description:P35228
Residue:1153
BDBM50065828
NameBDBM50065828
Synonyms:CHEMBL542678 | N-(3-Aminomethyl-phenyl)-acetamidine
TypeSmall organic molecule
Emp. Form.C9H13N3
Mol. Mass.163.2196
SMILESCC(N)=Nc1cccc(CN)c1