Reaction Details
TargetNitric oxide synthase, inducible
LigandBDBM50065841
Substrate/Competitorn/a
Meas. Tech.ChEMBL_89333 (CHEMBL702708)
Ki 2000±n/a nM
Citation Collins, JLShearer, BGOplinger, JALee, SGarvey, EPSalter, MDuffy, CBurnette, TCFurfine, ES N-Phenylamidines as selective inhibitors of human neuronal nitric oxide synthase: structure-activity studies and demonstration of in vivo activity. J Med Chem41:2858-71 (1998) 
 
Nitric oxide synthase, inducible
Name:Nitric oxide synthase, inducible
Type:Homodimer
Mol. Mass.:131141.95
Organism:Homo sapiens (Human)
Description:P35228
Residue:1153
BDBM50065841
NameBDBM50065841
Synonyms:CHEMBL545025 | N-[4-(Acetimidoylamino-methyl)-phenyl]-acetamidine
TypeSmall organic molecule
Emp. Form.C11H16N4
Mol. Mass.204.2715
SMILESCC(=N)NCc1ccc(cc1)N=C(C)N