Reaction Details
TargetNitric oxide synthase, brain
LigandBDBM50065817
Substrate/Competitorn/a
Meas. Tech.ChEMBL_143377 (CHEMBL752276)
Ki 190±n/a nM
Citation Collins, JLShearer, BGOplinger, JALee, SGarvey, EPSalter, MDuffy, CBurnette, TCFurfine, ES N-Phenylamidines as selective inhibitors of human neuronal nitric oxide synthase: structure-activity studies and demonstration of in vivo activity. J Med Chem41:2858-71 (1998) 
 
Nitric oxide synthase, brain
Name:Nitric oxide synthase, brain
Type:Homodimer
Mol. Mass.:160985.98
Organism:Homo sapiens (Human)
Description:P29475
Residue:1434
BDBM50065817
NameBDBM50065817
Synonyms:2-Amino-N-(3-aminomethyl-phenyl)-acetamidine | CHEMBL542675
TypeSmall organic molecule
Emp. Form.C9H14N4
Mol. Mass.178.2343
SMILESNCC(N)=Nc1cccc(CN)c1