Reaction Details
TargetNitric oxide synthase, inducible
LigandBDBM50065805
Substrate/Competitorn/a
Meas. Tech.ChEMBL_89333 (CHEMBL702708)
Ki 140±n/a nM
Citation Collins, JLShearer, BGOplinger, JALee, SGarvey, EPSalter, MDuffy, CBurnette, TCFurfine, ES N-Phenylamidines as selective inhibitors of human neuronal nitric oxide synthase: structure-activity studies and demonstration of in vivo activity. J Med Chem41:2858-71 (1998) 
 
Nitric oxide synthase, inducible
Name:Nitric oxide synthase, inducible
Type:Homodimer
Mol. Mass.:131141.95
Organism:Homo sapiens (Human)
Description:P35228
Residue:1153
BDBM50065805
NameBDBM50065805
Synonyms:CHEMBL544788 | N-(3-Aminomethyl-benzyl)-acetamidine
TypeSmall organic molecule
Emp. Form.C10H15N3
Mol. Mass.177.2462
SMILESCC(=N)NCc1cccc(CN)c1