Reaction Details
TargetNitric oxide synthase, brain
LigandBDBM50230993
Substrate/Competitorn/a
Meas. Tech.ChEMBL_143377 (CHEMBL752276)
Ki 840±n/a nM
Citation Collins, JLShearer, BGOplinger, JALee, SGarvey, EPSalter, MDuffy, CBurnette, TCFurfine, ES N-Phenylamidines as selective inhibitors of human neuronal nitric oxide synthase: structure-activity studies and demonstration of in vivo activity. J Med Chem41:2858-71 (1998) 
 
Nitric oxide synthase, brain
Name:Nitric oxide synthase, brain
Type:Homodimer
Mol. Mass.:160985.98
Organism:Homo sapiens (Human)
Description:P29475
Residue:1434
BDBM50230993
NameBDBM50230993
Synonyms:(2S)-2-amino-5-[(N-methylcarbamimidoyl)amino]pentanoic acid (R)-2-Amino-5-(N'-methyl-guanidino)-pentanoic acid (S)-2-amino-5-(2-methylguanidino)pentanoic acid 2-Amino-5-(N'-methyl-guanidino)-pentanoic acid L-NMMA N(G)-mono-methyl-L-arginine N-Monomethyl-L-arginine NG-Monomethyl-L-Arginine Ngamma-monomethyl-L-arginine | Targinine
TypeSmall organic molecule
Emp. Form.C7H16N4O2
Mol. Mass.188.2275
SMILESCNC(N)=NCCC[C@H](N)C(O)=O