Reaction Details
TargetNitric oxide synthase, inducible
LigandBDBM50065843
Substrate/Competitorn/a
Meas. Tech.ChEMBL_89333 (CHEMBL702708)
Ki 120±n/a nM
Citation Collins, JLShearer, BGOplinger, JALee, SGarvey, EPSalter, MDuffy, CBurnette, TCFurfine, ES N-Phenylamidines as selective inhibitors of human neuronal nitric oxide synthase: structure-activity studies and demonstration of in vivo activity. J Med Chem41:2858-71 (1998) 
 
Nitric oxide synthase, inducible
Name:Nitric oxide synthase, inducible
Type:Homodimer
Mol. Mass.:131141.95
Organism:Homo sapiens (Human)
Description:P35228
Residue:1153
BDBM50065843
NameBDBM50065843
Synonyms:CHEMBL553081 N-(3-Aminomethyl-phenyl)-thiophene-2-carboxamidine
TypeSmall organic molecule
Emp. Form.C12H13N3S
Mol. Mass.231.317
SMILESNCc1cccc(c1)N=C(N)c1cccs1