Reaction Details
TargetDelta-type opioid receptor
LigandBDBM50065854
Substrate/Competitorn/a
Meas. Tech.ChEMBL_146911 (CHEMBL757499)
Ki 0.61±n/a nM
Citation Ananthan, SJohnson, CACarter, RLClayton, SDRice, KCXu, HDavis, PPorreca, FRothman, RB Synthesis, opioid receptor binding, and bioassay of naltrindole analogues substituted in the indolic benzene moiety. J Med Chem41:2872-81 (1998) 
 
Delta-type opioid receptor
Name:Delta-type opioid receptor
Type:G Protein-Coupled Receptor (GPCR)
Mol. Mass.:40465.04
Organism:Rattus norvegicus (rat)
Description:Competition binding assays were using CHO-K1 cell membranes expressing the opioid receptor.
Residue:372
BDBM50065854
NameBDBM50065854
Synonyms:22-cyclopropylmethyl-9-phenoxy-14-oxa-11,22-diazaheptacyclo[13.9.1.01,13.02,21.04,12.05,10.019,25]pentacosa-4(12),5(10),6,8,15(25),16,18-heptaene-2,16-diol | CHEMBL317298
TypeSmall organic molecule
Emp. Form.C32H30N2O4
Mol. Mass.506.5916
SMILESOc1ccc2C[C@H]3N(CC4CC4)CC[C@@]45C(Oc1c24)c1[nH]c2c(Oc4ccccc4)cccc2c1C[C@@]35O