Reaction Details
TargetProgesterone receptor
LigandBDBM50066528
Substrate/Competitorn/a
Meas. Tech.ChEMBL_159543 (CHEMBL765659)
Ki 182±n/a nM
Citation Pooley, CLEdwards, JPGoldman, MEWang, MWMarschke, KBCrombie, DLJones, TK Discovery and preliminary SAR studies of a novel, nonsteroidal progesterone receptor antagonist pharmacophore. J Med Chem41:3461-6 (1998) 
 
Progesterone receptor
Name:Progesterone receptor
Type:Protein
Mol. Mass.:98979.52
Organism:Homo sapiens (Human)
Description:P06401
Residue:933
BDBM50066528
NameBDBM50066528
Synonyms:6-(3-Fluoro-phenyl)-2,2,4-trimethyl-1,2-dihydro-quinoline CHEMBL117585
TypeSmall organic molecule
Emp. Form.C18H18FN
Mol. Mass.267.3406
SMILESCC1=CC(C)(C)Nc2ccc(cc12)-c1cccc(F)c1