Reaction Details
TargetProgesterone receptor
LigandBDBM50066526
Substrate/Competitorn/a
Meas. Tech.ChEMBL_159543 (CHEMBL765659)
Ki 10±n/a nM
Citation Pooley, CLEdwards, JPGoldman, MEWang, MWMarschke, KBCrombie, DLJones, TK Discovery and preliminary SAR studies of a novel, nonsteroidal progesterone receptor antagonist pharmacophore. J Med Chem41:3461-6 (1998) 
 
Progesterone receptor
Name:Progesterone receptor
Type:Protein
Mol. Mass.:98979.52
Organism:Homo sapiens (Human)
Description:P06401
Residue:933
BDBM50066526
NameBDBM50066526
Synonyms:3-Fluoro-5-(2,2,4-trimethyl-1,2-dihydro-quinolin-6-yl)-benzonitrile CHEMBL117465
TypeSmall organic molecule
Emp. Form.C19H17FN2
Mol. Mass.292.3501
SMILESCC1=CC(C)(C)Nc2ccc(cc12)-c1cc(F)cc(c1)C#N