Reaction Details
TargetGlutamate receptor ionotropic, NMDA 1/2B
LigandBDBM50066546
Substrate/Competitorn/a
Meas. Tech.ChEMBL_58 (CHEMBL615181)
IC50 45±n/a nM
Citation Tamiz, APWhittemore, ERZhou, ZLHuang, JCDrewe, JAChen, JCCai, SXWeber, EWoodward, RMKeana, JF Structure-activity relationships for a series of bis(phenylalkyl)amines: potent subtype-selective inhibitors of N-methyl-D-aspartate receptors. J Med Chem41:3499-506 (1998) 
 
Glutamate receptor ionotropic, NMDA 1/2B
Name:Glutamate receptor ionotropic, NMDA 1/2B
Type:n/a
Mol. Mass.:n/a
Description:ASSAY_ID of EBI is 141026
Components:This complex has 2 components.
Component 1
Name:Glutamate receptor ionotropic, NMDA 2B
Synonyms:GluN2B Grin2b NMDA receptor subunit N2B (GluN2B) NMDE2_RAT | NR2B
Type:Protein
Mol. Mass.:166077.66
Organism:Rattus norvegicus (Rat)
Description:Q00960
Residue:1482
Component 2
Name:Glutamate receptor ionotropic, NMDA 1
Synonyms:Glutamate (NMDA) receptor subunit zeta 1 Glutamate-NMDA-Channel Glutamate-NMDA-Polyamine NMDA Nmdar1 | phencyclidine
Type:Enzyme Catalytic Domain
Mol. Mass.:105533.40
Organism:RAT
Description:P35439
Residue:938
BDBM50066546
NameBDBM50066546
Synonyms:4-[3-(5-Phenyl-pentylamino)-propyl]-phenol | CHEMBL334003
TypeSmall organic molecule
Emp. Form.C20H27NO
Mol. Mass.297.4345
SMILESOc1ccc(CCCNCCCCCc2ccccc2)cc1