Reaction Details
TargetMatrix metalloproteinase-9
LigandBDBM8465
Substrate/Competitorn/a
Meas. Tech.ChEMBL_105402 (CHEMBL710821)
Ki 8±n/a nM
Citation Pikul, SMcDow Dunham, KLAlmstead, NGDe, BNatchus, MGAnastasio, MVMcPhail, SJSnider, CETaiwo, YORydel, TDunaway, CMGu, FMieling, GE Discovery of potent, achiral matrix metalloproteinase inhibitors. J Med Chem41:3568-71 (1998) 
 
Matrix metalloproteinase-9
Name:Matrix metalloproteinase-9
Type:Enzyme
Mol. Mass.:78452.28
Organism:Homo sapiens (Human)
Description:P14780
Residue:707
BDBM8465
NameBDBM8465
Synonyms:(2R)-N-hydroxy-2-[(4-methoxybenzene)(pyridin-3-ylmethyl)sulfonamido]-3-methylbutanamide CGS 27023 CHEMBL514138 | hydroxamate analogue 1
TypeSmall organic molecule
Emp. Form.C18H23N3O5S
Mol. Mass.393.457
SMILESCOc1ccc(cc1)S(=O)(=O)N(Cc1cccnc1)[C@H](C(C)C)C(=O)NO