Reaction Details
TargetP2Y purinoceptor 1
LigandBDBM50118229
Substrate/Competitorn/a
Meas. Tech.ChEMBL_162504 (CHEMBL767332)
IC50 330±n/a nM
Citation Camaioni, EBoyer, JLMohanram, AHarden, TKJacobson, KA Deoxyadenosine bisphosphate derivatives as potent antagonists at P2Y1 receptors. J Med Chem41:183-90 (1998) 
 
P2Y purinoceptor 1
Name:P2Y purinoceptor 1
Type:n/a
Mol. Mass.:41199.64
Organism:Meleagris gallopavo
Description:n/a
Residue:362
BDBM50118229
NameBDBM50118229
Synonyms:CHEMBL129841 | MRS 2179
TypeSmall organic molecule
Emp. Form.C11H17N5O9P2
Mol. Mass.425.2283
SMILESCNc1ncnc2n(cnc12)[C@H]1C[C@H](OP(O)(O)=O)[C@@H](COP(O)(O)=O)O1