Reaction Details
TargetD(2) dopamine receptor
LigandBDBM50066910
Substrate/Competitorn/a
Meas. Tech.ChEMBL_62400 (CHEMBL675725)
Ki 49.6±n/a nM
Citation Campiani, GNacci, VBechelli, SCiani, SMGarofalo, AFiorini, IWikström, Hde Boer, PLiao, YTepper, PGCagnotto, AMennini, T New antipsychotic agents with serotonin and dopamine antagonist properties based on a pyrrolo[2,1-b][1,3]benzothiazepine structure. J Med Chem41:3763-72 (1998) 
 
D(2) dopamine receptor
Name:D(2) dopamine receptor
Type:G Protein-Coupled Receptor (GPCR)
Mol. Mass.:50931.60
Organism:Rattus norvegicus (rat)
Description:P61169
Residue:444
BDBM50066910
NameBDBM50066910
Synonyms:(+/-)7-Chloro-9-(4-methyl-piperazin-1-yl)-9,10-dihydro-4-thia-10a-aza-benzo[f]azulene (S)-(+)-7-Chloro-9-(4-methyl-piperazin-1-yl)-9,10-dihydro-4-thia-10a-aza-benzo[f]azulene(ST1460) CHEMBL120512
TypeSmall organic molecule
Emp. Form.C17H20ClN3S
Mol. Mass.333.879
SMILESCN1CCN(CC1)C1Cn2cccc2Sc2ccc(Cl)cc12