Reaction Details
TargetBeta-lactamase
LigandBDBM50067069
Substrate/Competitorn/a
Meas. Tech.ChEMBL_40259 (CHEMBL656489)
IC50 12±n/a nM
Citation Hubschwerlen, CAngehrn, PGubernator, KPage, MGSpecklin, JL Structure-based design of beta-lactamase inhibitors. 2. Synthesis and evaluation of bridged sulfactams and oxamazins. J Med Chem41:3972-5 (1998) 
 
Beta-lactamase
Name:Beta-lactamase
Type:PROTEIN
Mol. Mass.:41306.67
Organism:Enterobacter cloacae
Description:ChEMBL_40258
Residue:381
BDBM50067069
NameBDBM50067069
Synonyms:CHEMBL128220 | sodium salt-Sulfuric acid mono-[2-(4-carbamoyl-phenylcarbamoyl)-7-oxo-2,6-diaza-bicyclo[3.2.0]hept-6-yl] ester
TypeSmall organic molecule
Emp. Form.C13H13N4O7S
Mol. Mass.369.33
SMILESNC(=O)c1ccc(NC(=O)N2CCC3C2C(=O)N3OS([O-])(=O)=O)cc1