Reaction Details
TargetB2 bradykinin receptor
LigandBDBM50067248
Substrate/Competitorn/a
Meas. Tech.ChEMBL_40264 (CHEMBL653280)
IC50 0.440000±n/a nM
Citation Abe, YKayakiri, HSatoh, SInoue, TSawada, YInamura, NAsano, MHatori, CSawai, HOku, TTanaka, H A novel class of orally active non-peptide bradykinin B2 receptor antagonists. 2. Overcoming the species difference between guinea pig and man. J Med Chem41:4053-61 (1998) 
 
B2 bradykinin receptor
Name:B2 bradykinin receptor
Type:n/a
Mol. Mass.:42217.03
Organism:Cavia porcellus
Description:n/a
Residue:372
BDBM50067248
NameBDBM50067248
Synonyms:5-{2-[({[3-(3-Bromo-2-methyl-imidazo[1,2-a]pyridin-8-yloxymethyl)-2,4-dichloro-phenyl]-methyl-carbamoyl}-methyl)-carbamoyl]-vinyl}-pyridine-2-carboxylic acid dimethylamide; Dihydrochloride | CHEMBL539550
TypeSmall organic molecule
Emp. Form.C29H27BrCl2N6O4
Mol. Mass.674.372
SMILESCN(C)C(=O)c1ccc(\C=C\C(=O)NCC(=O)N(C)c2ccc(Cl)c(COc3cccn4c(Br)c(C)nc34)c2Cl)cn1