Reaction Details
TargetB2 bradykinin receptor
LigandBDBM50067301
Substrate/Competitorn/a
Meas. Tech.ChEMBL_40265 (CHEMBL656501)
IC50 0.460000±n/a nM
Citation Abe, YKayakiri, HSatoh, SInoue, TSawada, YInamura, NAsano, MAramori, IHatori, CSawai, HOku, TTanaka, H A novel class of orally active non-peptide bradykinin B2 receptor antagonists. 3. Discovering bioisosteres of the imidazo[1,2-a] pyridine moiety. J Med Chem41:4062-79 (1998) 
 
B2 bradykinin receptor
Name:B2 bradykinin receptor
Type:n/a
Mol. Mass.:42217.03
Organism:Cavia porcellus
Description:n/a
Residue:372
BDBM50067301
NameBDBM50067301
Synonyms:(E)-3-(6-Acetylamino-pyridin-3-yl)-N-({[2,4-dichloro-3-(2-methyl-quinolin-8-yloxymethyl)-phenyl]-methyl-carbamoyl}-methyl)-acrylamide CHEMBL130517 | FK-3657
TypeSmall organic molecule
Emp. Form.C30H27Cl2N5O4
Mol. Mass.592.472
SMILESCN(C(=O)CNC(=O)\C=C\c1ccc(NC(C)=O)nc1)c1ccc(Cl)c(COc2cccc3ccc(C)nc23)c1Cl