Reaction Details
TargetAcetylcholinesterase
LigandBDBM50064176
Substrate/Competitorn/a
Meas. Tech.ChEMBL_28904 (CHEMBL638603)
IC50 5370±n/a nM
Citation Melchiorre, CAndrisano, VBolognesi, MLBudriesi, RCavalli, ACavrini, VRosini, MTumiatti, VRecanatini, M Acetylcholinesterase noncovalent inhibitors based on a polyamine backbone for potential use against Alzheimer's disease. J Med Chem41:4186-9 (1998) 
 
Acetylcholinesterase
Name:Acetylcholinesterase
Type:Enzyme
Mol. Mass.:67792.70
Organism:Homo sapiens (Human)
Description:P22303
Residue:614
BDBM50064176
NameBDBM50064176
Synonyms:CHEMBL27673 METHOCTRAMINE N1,N8-bis(6-(2-methoxybenzylamino)hexyl)octane-1,8-diamine
TypeSmall organic molecule
Emp. Form.C36H62N4O2
Mol. Mass.582.9031
SMILESCOc1ccccc1CNCCCCCCNCCCCCCCCNCCCCCCNCc1ccccc1OC