Reaction Details
TargetB2 bradykinin receptor
LigandBDBM50067930
Substrate/Competitorn/a
Meas. Tech.ChEMBL_40274 (CHEMBL656509)
IC50 0.640±n/a nM
Citation Abe, YKayakiri, HSatoh, SInoue, TSawada, YInamura, NAsano, MAramori, IHatori, CSawai, HOku, TTanaka, H A novel class of orally active non-peptide bradykinin B2 receptor antagonists. 4. Discovery of novel frameworks mimicking the active conformation. J Med Chem41:4587-98 (1998) 
 
B2 bradykinin receptor
Name:B2 bradykinin receptor
Type:Enzyme Catalytic Domain
Mol. Mass.:44467.17
Organism:Homo sapiens (Human)
Description:B2 BRADYKININ BDKRB2 HUMAN::P30411
Residue:391
BDBM50067930
NameBDBM50067930
Synonyms:4-[(E)-2-({1-[2,4-Dichloro-3-(2-methyl-quinolin-8-yloxymethyl)-phenyl]-1H-pyrrol-2-ylmethyl}-carbamoyl)-vinyl]-N-methyl-benzamide; hydrochloride | CHEMBL553911
TypeSmall organic molecule
Emp. Form.C33H28Cl2N4O3
Mol. Mass.599.506
SMILESCNC(=O)c1ccc(\C=C\C(=O)NCc2cccn2-c2ccc(Cl)c(COc3cccc4ccc(C)nc34)c2Cl)cc1