Reaction Details
TargetSodium-dependent dopamine transporter
LigandBDBM50068473
Substrate/Competitorn/a
Meas. Tech.ChEMBL_62340 (CHEMBL674432)
Ki 2±n/a nM
Citation Kozikowski, APAraldi, GLPrakash, KRZhang, MJohnson, KM Synthesis and biological properties of new 2beta-alkyl- and 2beta-aryl-3-(substituted phenyl)tropane derivatives: stereochemical effect of C-3 on affinity and selectivity for neuronal dopamine and serotonin transporters. J Med Chem41:4973-82 (1999) 
 
Sodium-dependent dopamine transporter
Name:Sodium-dependent dopamine transporter
Type:Multi-pass membrane protein
Mol. Mass.:68749.45
Organism:Rattus norvegicus (rat)
Description:P23977
Residue:619
BDBM50068473
NameBDBM50068473
Synonyms:(2S,8S)-3-(4-Fluoro-phenyl)-8-methyl-2-propyl-8-aza-bicyclo[3.2.1]octane
TypeSmall organic molecule
Emp. Form.C17H24FN
Mol. Mass.261.3776
SMILESCCC[C@@H]1C2CCC(CC1c1ccc(F)cc1)N2C