Reaction Details
TargetSodium-dependent dopamine transporter
LigandBDBM50068471
Substrate/Competitorn/a
Meas. Tech.ChEMBL_62465 (CHEMBL878278)
Ki 2.6±n/a nM
Citation Kozikowski, APAraldi, GLPrakash, KRZhang, MJohnson, KM Synthesis and biological properties of new 2beta-alkyl- and 2beta-aryl-3-(substituted phenyl)tropane derivatives: stereochemical effect of C-3 on affinity and selectivity for neuronal dopamine and serotonin transporters. J Med Chem41:4973-82 (1999) 
 
Sodium-dependent dopamine transporter
Name:Sodium-dependent dopamine transporter
Type:Multi-pass membrane protein
Mol. Mass.:68749.45
Organism:Rattus norvegicus (rat)
Description:P23977
Residue:619
BDBM50068471
NameBDBM50068471
Synonyms:(2R,8S)-8-Methyl-2-phenyl-3-p-tolyl-8-aza-bicyclo[3.2.1]octane
TypeSmall organic molecule
Emp. Form.C21H25N
Mol. Mass.291.4299
SMILESCN1C2CCC1[C@H](C(C2)c1ccc(C)cc1)c1ccccc1