Reaction Details
TargetDelta-type opioid receptor
LigandBDBM50068651
Substrate/Competitorn/a
Meas. Tech.ChEMBL_146910 (CHEMBL757498)
Ki 543±n/a nM
Citation Tourwé, DMannekens, EDiem, TNVerheyden, PJaspers, HTóth, GPéter, AKertész, ITörök, GChung, NNSchiller, PW Side chain methyl substitution in the delta-opioid receptor antagonist TIPP has an important effect on the activity profile. J Med Chem41:5167-76 (1999) 
 
Delta-type opioid receptor
Name:Delta-type opioid receptor
Type:G Protein-Coupled Receptor (GPCR)
Mol. Mass.:40382.98
Organism:Homo sapiens (Human)
Description:Competition binding assays were carried out using membrane preparations from transfected HN9.10 cells that constitutively expressed the delta opioid receptor.
Residue:372
BDBM50068651
NameBDBM50068651
Synonyms:2-[2-Amino-3-(4-hydroxy-phenyl)-propionyl]-1,2,3,4-tetrahydro-isoquinoline-3-carboxylic acid [1-((1R,2S)-1-carbamoyl-2-phenyl-propylcarbamoyl)-2-phenyl-ethyl]-amide | CHEMBL2371024
TypeSmall organic molecule
Emp. Form.C38H40N4O6
Mol. Mass.648.7474
SMILESC[C@H]1[C@@H](N(Cc2ccccc12)C(=O)[C@@H](N)Cc1ccc(O)cc1)C(=O)N[C@@H](Cc1ccccc1)C(=O)N[C@@H](Cc1ccccc1)C(O)=O