Reaction Details
TargetDelta-type opioid receptor
LigandBDBM50455191
Substrate/Competitorn/a
Meas. Tech.ChEMBL_146910 (CHEMBL757498)
Ki 28±n/a nM
Citation Tourwé, DMannekens, EDiem, TNVerheyden, PJaspers, HTóth, GPéter, AKertész, ITörök, GChung, NNSchiller, PW Side chain methyl substitution in the delta-opioid receptor antagonist TIPP has an important effect on the activity profile. J Med Chem41:5167-76 (1999) 
 
Delta-type opioid receptor
Name:Delta-type opioid receptor
Type:G Protein-Coupled Receptor (GPCR)
Mol. Mass.:40382.98
Organism:Homo sapiens (Human)
Description:Competition binding assays were carried out using membrane preparations from transfected HN9.10 cells that constitutively expressed the delta opioid receptor.
Residue:372
BDBM50455191
NameBDBM50455191
Synonyms:CHEMBL2371014
TypeSmall organic molecule
Emp. Form.C38H41N5O5
Mol. Mass.647.7626
SMILESC[C@@H]([C@@H](N)C(=O)N1Cc2ccccc2C[C@H]1C(=O)N[C@@H](Cc1ccccc1)C(=O)N[C@@H](Cc1ccccc1)C(N)=O)c1ccc(O)cc1