Reaction Details
TargetCannabinoid receptor 2
LigandBDBM50068669
Substrate/Competitorn/a
Meas. Tech.ChEMBL_46832 (CHEMBL657301)
Ki 2.1±n/a nM
Citation Reggio, PHBasu-Dutt, SBarnett-Norris, JCastro, MTHurst, DPSeltzman, HHRoche, MJGilliam, AFThomas, BFStevenson, LAPertwee, RGAbood, ME The bioactive conformation of aminoalkylindoles at the cannabinoid CB1 and CB2 receptors: insights gained from (E)- and (Z)-naphthylidene indenes. J Med Chem41:5177-87 (1999) 
 
Cannabinoid receptor 2
Name:Cannabinoid receptor 2
Type:G Protein-Coupled Receptor (GPCR)
Mol. Mass.:39690.94
Organism:Homo sapiens (Human)
Description:P34972
Residue:360
BDBM50068669
NameBDBM50068669
Synonyms:4-(2-{2-Methyl-3-[1-naphthalen-1-yl-meth-(Z)-ylidene]-3H-inden-1-yl}-ethyl)-morpholine | CHEMBL123916
TypeSmall organic molecule
Emp. Form.C27H27NO
Mol. Mass.381.5094
SMILESCC1=C(CCN2CCOCC2)c2ccccc2\C1=C\c1cccc2ccccc12